{"text_format":"1","workbook":"xlsx","n_sheets":7,"sheets":["Foglio1","Foglio2","Foglio2 (4)","Foglio2 (3)","Foglio3","Foglio5","Foglio4"],"not_rendered":{"charts":0,"images":4,"macros":1,"external_links":0,"defined_names":4,"comments":0,"pivot_tables":0},"unopened":[],"bounds":{"document_bytes":16777216,"sheet_cells":100000,"rows_first":2000,"rows_last":500,"rows_between":2000,"halvings":0,"cell_chars":16384,"cell_head_chars":4096},"cells_cut":0,"cells_raw":0,"read":"whole","date_system":"1900"}

{"sheet":"Foglio1","index":0,"n_rows":1,"n_cols":2,"rows_kept":1,"cut":false,"hidden":false,"merged":[[0,1,0,12]]}
[null,"COSTI SERVIZI UNEP DI SASSARI "]

{"sheet":"Foglio2","index":1,"n_rows":80,"n_cols":18,"rows_kept":80,"cut":false,"hidden":false,"merged":[[0,10,0,11],[28,0,28,10],[30,2,30,10],[47,0,47,1],[48,0,48,1],[0,0,0,1],[39,0,39,2],[4,0,4,1],[13,0,13,1],[14,0,14,1],[31,0,31,1],[32,0,32,1],[46,0,46,1],[69,0,69,1],[45,0,45,1],[52,3,52,14],[68,0,68,1],[63,0,63,1],[49,0,49,1],[66,0,66,1],[65,0,65,1],[67,0,67,1],[53,3,53,14],[80,0,80,11],[79,0,79,11],[56,0,56,1],[78,0,78,11],[57,0,57,1],[58,0,58,1],[59,0,59,1],[74,0,74,1],[60,0,60,1],[61,0,61,1],[62,0,62,1],[76,0,76,11],[64,0,64,1],[71,0,71,1],[77,0,77,11],[70,0,70,1]]}
["SPECIFICA NOTIFICHE ",null,null,"    SELEZIONARE NELLE CELLE  INDICATE DALLE FRECCE                                   ",null,null,"SPECIFICA NORMALE",null,"SPECIFICA  URGENTE",null,"Ritorna alla pagina inziale"]
[]
[null,null,null,"❶ Inserire nella cella sottostante indicata dalla freccia  il numero dei destinatari dell'atto"]
[]
["DIRITTI* ①",null,null,0,null,null,{"$f":"IF(D5>0,D5<=2)*2.58+AND(D5>=3,D5<=6)*7.75+AND(D5>6)*12.39","v":0},null,{"$f":"IF(D5>0,D5<=2)*3.87+AND(D5>=3,D5<=6)*11.63+AND(D5>6)*18.59","v":0}]
[]
[]
[]
[null,null,null,"❷ Inserire nelle celle sottostanti indicate dalle frecce il nome delle vie che interessano (solo il nome senza via, viale, corso etc)  e selezionarle dal menù a"]
[null,null,null," tendina a destra della riga. Per facilitare la ricerca inserire le inziali della via (es. per via roma inserire la lettera R), aprendo il menù a tendina "]
[null,null,null,"appariranno in ordine alfabetico tutte le vie che iniziano con la lettera R."]
[null,null,null,"Per le vie che si compongono di nome e cognome, effettuare la ricerca partendo dal cognome.",null,null,null,"*Per evitare errori selezionare sempre dal menù a tendina."]
[]
["TRASFERTE* ②"]
["Vie di Sassari"]
[null,"1°",null,null,{"$f":"LOOKUP(D16,Foglio3!B2:B1104,Foglio3!C2:C1104)","v":{"$error":"#N/A"}},null,{"$f":"IF(E16>0,E16<=6)*3.7+AND(E16>=7,E16<=12)*6.75+AND(E16>=13,E16<=21)*9.33+AND(E16>=22,E16<=27)*11.3+AND(E16>=28,E16<=33)*13.27+AND(E16>=34,E16<=39)*15.24+AND(E16>=40,E16<=45)*17.21+AND(E16>=46,E16<=51)*19.18+AND(E16>=52,E16<=57)*21.15+AND(E16>=58,E16<=63)*23.12+AND(E16>=64,E16<=69)*25.09+AND(E16>=70,E16<=75)*27.06+AND(E16>=76,E16<=81)*29.03+AND(E16>=82,E16<=87)*31+AND(E16>=88,E16<=93)*32.97+AND(E16>=94,E16<=99)*34.94+AND(E16>=100,E16<=105)*36.91+AND(E16>=106,E16<=111)*38.88","v":{"$error":"#N/A"}},null,{"$f":"IF(E16>0,E16<=6)*5.55+AND(E16>=7,E16<=12)*10.13+AND(E16>=13,E16<=21)*14+AND(E16>=22,E16<=27)*16.95+AND(E16>=28,E16<=33)*19.91+AND(E16>=34,E16<=39)*22.86+AND(E16>=40,E16<=45)*25.82+AND(E16>=46,E16<=51)*28.77+AND(E16>=52,E16<=57)*31.73+AND(E16>=58,E16<=63)*34.68+AND(E16>=64,E16<=69)*37.64+AND(E16>=70,E16<=75)*40.59+AND(E16>=76,E16<=81)*43.55+AND(E16>=82,E16<=87)*46.5+AND(E16>=88,E16<=93)*49.46+AND(E16>=94,E16<=99)*52.41+AND(E16>=100,E16<=105)*55.37+AND(E16>=106,E16<=111)*58.32","v":{"$error":"#N/A"}},null,null,null,null,null,null,null,{"$f":"IF(G16>0,7.05)","v":{"$error":"#N/A"}},{"$f":"IF(I16>0,7.05)","v":{"$error":"#N/A"}}]
[null,"2°",null,null,{"$f":"LOOKUP(D17,Foglio3!B2:B1104,Foglio3!C2:C1104)","v":{"$error":"#N/A"}},null,{"$f":"IF(E17>0,E17<=6)*3.7+AND(E17>=7,E17<=12)*6.75+AND(E17>=13,E17<=21)*9.33+AND(E17>=22,E17<=27)*11.3+AND(E17>=28,E17<=33)*13.27+AND(E17>=34,E17<=39)*15.24+AND(E17>=40,E17<=45)*17.21+AND(E17>=46,E17<=51)*19.18+AND(E17>=52,E17<=57)*21.15+AND(E17>=58,E17<=63)*23.12+AND(E17>=64,E17<=69)*25.09+AND(E17>=70,E17<=75)*27.06+AND(E17>=76,E17<=81)*29.03+AND(E17>=82,E17<=87)*31+AND(E17>=88,E17<=93)*32.97+AND(E17>=94,E17<=99)*34.94+AND(E17>=100,E17<=105)*36.91+AND(E17>=106,E17<=111)*38.88","v":{"$error":"#N/A"}},null,{"$f":"IF(E17>0,E17<=6)*5.55+AND(E17>=7,E17<=12)*10.13+AND(E17>=13,E17<=21)*14+AND(E17>=22,E17<=27)*16.95+AND(E17>=28,E17<=33)*19.91+AND(E17>=34,E17<=39)*22.86+AND(E17>=40,E17<=45)*25.82+AND(E17>=46,E17<=51)*28.77+AND(E17>=52,E17<=57)*31.73+AND(E17>=58,E17<=63)*34.68+AND(E17>=64,E17<=69)*37.64+AND(E17>=70,E17<=75)*40.59+AND(E17>=76,E17<=81)*43.55+AND(E17>=82,E17<=87)*46.5+AND(E17>=88,E17<=93)*49.46+AND(E17>=94,E17<=99)*52.41+AND(E17>=100,E17<=105)*55.37+AND(E17>=106,E17<=111)*58.32","v":{"$error":"#N/A"}},null,null,null,null,null,null,null,{"$error":"#N/A"},{"$error":"#N/A"}]
[null,"3°",null,null,{"$f":"LOOKUP(D18,Foglio3!B2:B1104,Foglio3!C2:C1104)","v":{"$error":"#N/A"}},null,{"$error":"#N/A"},null,{"$error":"#N/A"},null,null,null,null,null,null,null,{"$error":"#N/A"},{"$error":"#N/A"}]
[null,"4°",null,null,{"$f":"LOOKUP(D19,Foglio3!B2:B1104,Foglio3!C2:C1104)","v":{"$error":"#N/A"}},null,{"$error":"#N/A"},null,{"$error":"#N/A"},null,null,null,null,null,null,null,{"$error":"#N/A"},{"$error":"#N/A"}]
[null,"5°",null,null,{"$f":"LOOKUP(D20,Foglio3!B2:B1104,Foglio3!C2:C1104)","v":{"$error":"#N/A"}},null,{"$error":"#N/A"},null,{"$error":"#N/A"},null,null,null,null,null,null,null,{"$error":"#N/A"},{"$error":"#N/A"}]
[null,"6°",null,null,{"$f":"LOOKUP(D21,Foglio3!B2:B1104,Foglio3!C2:C1104)","v":{"$error":"#N/A"}},null,{"$error":"#N/A"},null,{"$error":"#N/A"},null,null,null,null,null,null,null,{"$error":"#N/A"},{"$error":"#N/A"}]
[null,"7°",null,null,{"$f":"LOOKUP(D22,Foglio3!B2:B1104,Foglio3!C2:C1104)","v":{"$error":"#N/A"}},null,{"$error":"#N/A"},null,{"$error":"#N/A"},null,null,null,null,null,null,null,{"$error":"#N/A"},{"$error":"#N/A"}]
[null,"8°",null,null,{"$f":"LOOKUP(D23,Foglio3!B2:B1104,Foglio3!C2:C1104)","v":{"$error":"#N/A"}},null,{"$error":"#N/A"},null,{"$error":"#N/A"},null,null,null,null,null,null,null,{"$error":"#N/A"},{"$error":"#N/A"}]
[null,"9°",null,null,{"$f":"LOOKUP(D24,Foglio3!B2:B1104,Foglio3!C2:C1104)","v":{"$error":"#N/A"}},null,{"$error":"#N/A"},null,{"$error":"#N/A"},null,null,null,null,null,null,null,{"$error":"#N/A"},{"$error":"#N/A"}]
[null,"10°",null,null,{"$f":"LOOKUP(D25,Foglio3!B2:B1104,Foglio3!C2:C1104)","v":{"$error":"#N/A"}},null,{"$error":"#N/A"},null,{"$error":"#N/A"},null,null,null,null,null,null,null,{"$error":"#N/A"},{"$error":"#N/A"}]
[]
[]
[]
[]
[]
{"$rows_left_out":51}
{"sheet":"Foglio2 (4)","index":2,"n_rows":88,"n_cols":13,"rows_kept":88,"cut":false,"hidden":false,"merged":[[10,0,10,1],[0,0,0,1],[0,12,0,13],[1,0,2,2],[3,0,3,1],[7,0,8,2],[55,0,55,1],[11,0,11,1],[20,0,20,1],[21,0,21,1],[35,0,35,10],[38,0,38,1],[39,0,39,1],[46,0,46,2],[52,0,52,1],[53,0,53,1],[54,0,54,1],[37,2,37,13],[72,0,72,1],[56,0,56,1],[59,3,59,15],[63,0,63,1],[64,0,64,1],[65,0,65,1],[66,0,66,1],[67,0,67,1],[68,0,68,1],[69,0,69,1],[70,0,70,1],[71,0,71,1],[88,0,88,12],[73,0,73,1],[74,0,74,1],[75,0,75,1],[76,0,76,1],[77,0,77,1],[78,0,78,1],[81,0,81,1],[85,0,85,12],[86,0,86,12],[87,0,87,12],[84,0,84,14]]}
["SPECIFICA  ESECUZIONI",null,null,"    SELEZIONARE NELLE CELLE  INDICATE DALLE FRECCE NELLA PROCEDURA ESECUTIVA CHE INTERESSA                                   ",null,null,"SPECIFICA NORMALE",null,"SPECIFICA  URGENTE",null,null,null,"   Ritorna alla pagina iniziale"]
["Pignoramento presso terzi"]
[null,null,null,"❶ Inserire  nella cella sottostante indicata dalla freccia  l'importo del precetto "]
["DIRITTI  ①",null,null,null,null,null,{"$f":"IF(D4>0,D4<=516.46)*2.58+AND(D4>=516.47,D4<=2582.28)*3.62+AND(D4>=2582.29)*6.71","v":0},null,{"$f":"IF(D4>0,D4<=516.46)*3.87+AND(D4>=516.47,D4<=2582.28)*5.43+AND(D4>=2582.29)*10.07","v":0}]
[]
[]
[]
["Pignoramento immobiliare                              Preavviso di rilascio ex art. 608 c.p.c."]
[]
[null,null,null,"❶ Inserire nella prima  cella  indicata dalle frecce  l'importo  di € 6,71. Per queste esecuzioni l'importo è fissato per legge (€6,71 o, se urgente, €10,07)"]
[]
["DIRITTI  ①",null,null,null,null,null,6.71,null,{"$f":"IF(G12>0,G12=6.71)*10.07","v":10.07}]
[]
[]
[]
[]
[null,null,null,"❷ Inserire nelle celle sottostanti indicate dalle frecce il nome delle vie che interessano (solo il nome, senza via, viale, corso etc)  e selezionarle dal menù a"]
[null,null,null,"a tendina a destra della riga. Per facilitare la ricerca inserire le inziali della via (es. per via roma inserire la lettera R), aprendo il menù a tendina appariranno"]
[null,null,null," in ordine alfabetico tutte le vie che iniziano con la lettera R.   Per le vie con nome e cognome, effettuare la ricerca partendo dal cognome."]
[null,null,null,"**Per evitare errori selezionare sempre dal menù a tendina."]
["TRASFERTE* ②"]
["Vie di Sassari"]
[null,"1°",null,null,{"$f":"LOOKUP(D23,Foglio3!B2:B1104,Foglio3!C2:C1104)","v":{"$error":"#N/A"}},null,{"$f":"IF(E23>0,E23<=6)*7.4+AND(E23>=7,E23<=12)*13.5+AND(E23>=13,E23<=21)*18.66+AND(E23>=22,E23<=27)*22.6+AND(E23>=28,E23<=33)*26.54+AND(E23>=34,E23<=39)*30.48+AND(E23>=40,E23<=45)*34.42+AND(E23>=46,E23<=51)*38.36+AND(E23>=52,E23<=57)*42.3+AND(E23>=58,E23<=63)*46.24+AND(E23>=64,E23<=69)*50.18+AND(E23>=70,E23<=75)*54.12+AND(E23>=76,E23<=81)*58.06+AND(E23>=82,E23<=87)*62+AND(E23>=88,E23<=93)*65.94+AND(E23>=94,E23<=99)*69.88+AND(E23>=100,E23<=105)*73.82+AND(E23>=106,E23<=111)*77.76","v":{"$error":"#N/A"}},null,{"$f":"IF(E23>0,E23<=6)*11.1+AND(E23>=7,E23<=12)*20.25+AND(E23>=13,E23<=21)*27.99+AND(E23>=22,E23<=27)*33.9+AND(E23>=28,E23<=33)*39.81+AND(E23>=34,E23<=39)*45.72+AND(E23>=40,E23<=45)*51.63+AND(E23>=46,E23<=51)*57.54+AND(E23>=52,E23<=57)*63.45+AND(E23>=58,E23<=63)*69.36+AND(E23>=64,E23<=69)*75.27+AND(E23>=70,E23<=75)*81.18+AND(E23>=76,E23<=81)*87.09+AND(E23>=82,E23<=87)*93+AND(E23>=88,E23<=93)*98.91+AND(E23>=94,E23<=99)*104.82+AND(E23>=100,E23<=105)*110.73+AND(E23>=106,E23<=111)*116.64","v":{"$error":"#N/A"}},{"$f":"IF(G23>0,6.8)","v":{"$error":"#N/A"}},{"$f":"IF(I23>0,6.8)","v":{"$error":"#N/A"}}]
[null,"2°",null,null,{"$f":"LOOKUP(D24,Foglio3!B2:B1104,Foglio3!C2:C1104)","v":{"$error":"#N/A"}},null,{"$f":"IF(E24>0,E24<=6)*7.4+AND(E24>=7,E24<=12)*13.5+AND(E24>=13,E24<=21)*18.66+AND(E24>=22,E24<=27)*22.6+AND(E24>=28,E24<=33)*26.54+AND(E24>=34,E24<=39)*30.48+AND(E24>=40,E24<=45)*34.42+AND(E24>=46,E24<=51)*38.36+AND(E24>=52,E24<=57)*42.3+AND(E24>=58,E24<=63)*46.24+AND(E24>=64,E24<=69)*50.18+AND(E24>=70,E24<=75)*54.12+AND(E24>=76,E24<=81)*58.06+AND(E24>=82,E24<=87)*62+AND(E24>=88,E24<=93)*65.94+AND(E24>=94,E24<=99)*69.88+AND(E24>=100,E24<=105)*73.82+AND(E24>=106,E24<=111)*77.76","v":{"$error":"#N/A"}},null,{"$f":"IF(E24>0,E24<=6)*11.1+AND(E24>=7,E24<=12)*20.25+AND(E24>=13,E24<=21)*27.99+AND(E24>=22,E24<=27)*33.9+AND(E24>=28,E24<=33)*39.81+AND(E24>=34,E24<=39)*45.72+AND(E24>=40,E24<=45)*51.63+AND(E24>=46,E24<=51)*57.54+AND(E24>=52,E24<=57)*63.45+AND(E24>=58,E24<=63)*69.36+AND(E24>=64,E24<=69)*75.27+AND(E24>=70,E24<=75)*81.18+AND(E24>=76,E24<=81)*87.09+AND(E24>=82,E24<=87)*93+AND(E24>=88,E24<=93)*98.91+AND(E24>=94,E24<=99)*104.82+AND(E24>=100,E24<=105)*110.73+AND(E24>=106,E24<=111)*116.64","v":{"$error":"#N/A"}},{"$error":"#N/A"},{"$f":"IF(I24>0,6.8)","v":{"$error":"#N/A"}}]
[null,"3°",null,null,{"$f":"LOOKUP(D25,Foglio3!B2:B1104,Foglio3!C2:C1104)","v":{"$error":"#N/A"}},null,{"$error":"#N/A"},null,{"$error":"#N/A"},{"$error":"#N/A"},{"$error":"#N/A"}]
[null,"4°",null,null,{"$f":"LOOKUP(D26,Foglio3!B2:B1104,Foglio3!C2:C1104)","v":{"$error":"#N/A"}},null,{"$error":"#N/A"},null,{"$error":"#N/A"},{"$error":"#N/A"},{"$error":"#N/A"}]
[null,"5°",null,null,{"$f":"LOOKUP(D27,Foglio3!B2:B1104,Foglio3!C2:C1104)","v":{"$error":"#N/A"}},null,{"$error":"#N/A"},null,{"$error":"#N/A"},{"$error":"#N/A"},{"$error":"#N/A"}]
[null,"6°",null,null,{"$f":"LOOKUP(D28,Foglio3!B2:B1104,Foglio3!C2:C1104)","v":{"$error":"#N/A"}},null,{"$error":"#N/A"},null,{"$error":"#N/A"},{"$error":"#N/A"},{"$error":"#N/A"}]
[null,"7°",null,null,{"$f":"LOOKUP(D29,Foglio3!B2:B1104,Foglio3!C2:C1104)","v":{"$error":"#N/A"}},null,{"$error":"#N/A"},null,{"$error":"#N/A"},{"$error":"#N/A"},{"$error":"#N/A"}]
[null,"8°",null,null,{"$f":"LOOKUP(D30,Foglio3!B2:B1104,Foglio3!C2:C1104)","v":{"$error":"#N/A"}},null,{"$error":"#N/A"},null,{"$error":"#N/A"},{"$error":"#N/A"},{"$error":"#N/A"}]
{"$rows_left_out":59}
{"sheet":"Foglio2 (3)","index":3,"n_rows":59,"n_cols":16,"rows_kept":59,"cut":false,"hidden":false,"merged":[[0,10,0,11],[10,0,10,1],[0,0,0,1],[1,0,2,2],[3,0,3,1],[7,0,8,2],[11,0,11,1],[19,0,19,1],[20,0,20,1],[34,0,34,10],[36,2,36,11],[37,0,37,1],[38,0,38,1],[45,0,45,2],[49,0,49,1],[59,0,59,11],[52,0,52,1],[55,0,55,11],[56,0,56,11],[57,0,57,11],[58,0,58,11]]}
["SPECIFICA  ESECUZIONI",null,null,"    SELEZIONARE NELLE CELLE  INDICATE DALLE FRECCE NELLA PROCEDURA ESECUTIVA CHE INTERESSA                                  ",null,null,"SPECIFICA NORMALE",null,"SPECIFICA  URGENTE",null,"   Ritorna alla pagina iniziale"]
["Pignoramento mobiliare presso il debitore"]
[null,null,null,"❶ Inserire  nella cella sottostante indicata dalla freccia  l'importo del precetto "]
["DIRITTI  ①",null,null,null,null,null,{"$f":"IF(D4>0,D4<=516.46)*2.58+AND(D4>=516.47,D4<=2582.28)*3.62+AND(D4>=2582.29)*6.71","v":0},null,{"$f":"IF(D4>0,D4<=516.46)*3.87+AND(D4>=516.47,D4<=2582.28)*5.43+AND(D4>=2582.29)*10.07","v":0}]
[]
[]
[]
["Esecuzione per  consegna e  rilascio          Esecuzione forzata obblighi di fare e non fare"]
[]
[null,null,null,"❶ Inserire nella prima  cella  indicata dalle frecce  l'importo  di € 6,71. Per queste esecuzioni l'importo è fissato per legge (€6,71 o, se urgente, €10,07)"]
[]
["DIRITTI  ①",null,null,null,null,null,6.71,null,{"$f":"IF(G12>0,G12=6.71)*10.07","v":10.07}]
[]
[]
[]
[null,null,null,"❷ Inserire nelle celle sottostanti indicate dalle frecce il nome delle vie che interessano (solo il nome senza via, viale, corso etc)  e selezionarle dal menù a"]
[null,null,null," tendina a destra della riga. Per facilitare la ricerca inserire le inziali della via (es. per via roma inserire la lettera R), aprendo il menù a tendina appariranno"]
[null,null,null," in ordine alfabetico tutte le vie che iniziano con la lettera R.   Per le vie con nome e cognome, effettuare la ricerca partendo dal cognome."]
[null,null,null,"**Per evitare errori selezionare sempre dal menù a tendina."]
["TRASFERTE* ②"]
["Vie di Sassari"]
[null,"1°",null,null,{"$f":"LOOKUP(D22,Foglio3!B2:B1104,Foglio3!C2:C1104)","v":{"$error":"#N/A"}},null,{"$f":"IF(E22>0,E22<=6)*7.4+AND(E22>=7,E22<=12)*13.5+AND(E22>=13,E22<=21)*18.66+AND(E22>=22,E22<=27)*22.6+AND(E22>=28,E22<=33)*26.54+AND(E22>=34,E22<=39)*30.48+AND(E22>=40,E22<=45)*34.42+AND(E22>=46,E22<=51)*38.36+AND(E22>=52,E22<=57)*42.3+AND(E22>=58,E22<=63)*46.24+AND(E22>=64,E22<=69)*50.18+AND(E22>=70,E22<=75)*54.12+AND(E22>=76,E22<=81)*58.06+AND(E22>=82,E22<=87)*62+AND(E22>=88,E22<=93)*65.94+AND(E22>=94,E22<=99)*69.88+AND(E22>=100,E22<=105)*73.82+AND(E22>=106,E22<=111)*77.76","v":{"$error":"#N/A"}},null,{"$f":"IF(E22>0,E22<=6)*11.1+AND(E22>=7,E22<=12)*20.25+AND(E22>=13,E22<=21)*27.99+AND(E22>=22,E22<=27)*33.9+AND(E22>=28,E22<=33)*39.81+AND(E22>=34,E22<=39)*45.72+AND(E22>=40,E22<=45)*51.63+AND(E22>=46,E22<=51)*57.54+AND(E22>=52,E22<=57)*63.45+AND(E22>=58,E22<=63)*69.36+AND(E22>=64,E22<=69)*75.27+AND(E22>=70,E22<=75)*81.18+AND(E22>=76,E22<=81)*87.09+AND(E22>=82,E22<=87)*93+AND(E22>=88,E22<=93)*98.91+AND(E22>=94,E22<=99)*104.82+AND(E22>=100,E22<=105)*110.73+AND(E22>=106,E22<=111)*116.64","v":{"$error":"#N/A"}}]
[null,"2°",null,null,{"$f":"LOOKUP(D23,Foglio3!B2:B1104,Foglio3!C2:C1104)","v":{"$error":"#N/A"}},null,{"$f":"IF(E23>0,E23<=6)*7.4+AND(E23>=7,E23<=12)*13.5+AND(E23>=13,E23<=21)*18.66+AND(E23>=22,E23<=27)*22.6+AND(E23>=28,E23<=33)*26.54+AND(E23>=34,E23<=39)*30.48+AND(E23>=40,E23<=45)*34.42+AND(E23>=46,E23<=51)*38.36+AND(E23>=52,E23<=57)*42.3+AND(E23>=58,E23<=63)*46.24+AND(E23>=64,E23<=69)*50.18+AND(E23>=70,E23<=75)*54.12+AND(E23>=76,E23<=81)*58.06+AND(E23>=82,E23<=87)*62+AND(E23>=88,E23<=93)*65.94+AND(E23>=94,E23<=99)*69.88+AND(E23>=100,E23<=105)*73.82+AND(E23>=106,E23<=111)*77.76","v":{"$error":"#N/A"}},null,{"$f":"IF(E23>0,E23<=6)*11.1+AND(E23>=7,E23<=12)*20.25+AND(E23>=13,E23<=21)*27.99+AND(E23>=22,E23<=27)*33.9+AND(E23>=28,E23<=33)*39.81+AND(E23>=34,E23<=39)*45.72+AND(E23>=40,E23<=45)*51.63+AND(E23>=46,E23<=51)*57.54+AND(E23>=52,E23<=57)*63.45+AND(E23>=58,E23<=63)*69.36+AND(E23>=64,E23<=69)*75.27+AND(E23>=70,E23<=75)*81.18+AND(E23>=76,E23<=81)*87.09+AND(E23>=82,E23<=87)*93+AND(E23>=88,E23<=93)*98.91+AND(E23>=94,E23<=99)*104.82+AND(E23>=100,E23<=105)*110.73+AND(E23>=106,E23<=111)*116.64","v":{"$error":"#N/A"}}]
[null,"3°",null,null,{"$f":"LOOKUP(D24,Foglio3!B2:B1104,Foglio3!C2:C1104)","v":{"$error":"#N/A"}},null,{"$error":"#N/A"},null,{"$error":"#N/A"}]
[null,"4°",null,null,{"$f":"LOOKUP(D25,Foglio3!B2:B1104,Foglio3!C2:C1104)","v":{"$error":"#N/A"}},null,{"$error":"#N/A"},null,{"$error":"#N/A"}]
[null,"5°",null,null,{"$f":"LOOKUP(D26,Foglio3!B2:B1104,Foglio3!C2:C1104)","v":{"$error":"#N/A"}},null,{"$error":"#N/A"},null,{"$error":"#N/A"}]
[null,"6°",null,null,{"$f":"LOOKUP(D27,Foglio3!B2:B1104,Foglio3!C2:C1104)","v":{"$error":"#N/A"}},null,{"$error":"#N/A"},null,{"$error":"#N/A"}]
[null,"7°",null,null,{"$f":"LOOKUP(D28,Foglio3!B2:B1104,Foglio3!C2:C1104)","v":{"$error":"#N/A"}},null,{"$error":"#N/A"},null,{"$error":"#N/A"}]
[null,"8°",null,null,{"$f":"LOOKUP(D29,Foglio3!B2:B1104,Foglio3!C2:C1104)","v":{"$error":"#N/A"}},null,{"$error":"#N/A"},null,{"$error":"#N/A"}]
[null,"9°",null,null,{"$f":"LOOKUP(D30,Foglio3!B2:B1104,Foglio3!C2:C1104)","v":{"$error":"#N/A"}},null,{"$error":"#N/A"},null,{"$error":"#N/A"}]
{"$rows_left_out":30}
{"sheet":"Foglio3","index":4,"n_rows":1104,"n_cols":4,"rows_kept":1104,"cut":false,"hidden":true,"merged":[]}
[]
["SV","ABBACURRENTE",30]
["VIA","ABBADU (DELL')",6,"A"]
["VIA","ABOZZI MICHELE",6]
["SV","ACCHETTAS",17]
["VIA","ADDIS FILIPPO",7]
["VIA","ADELASIA",5]
["VLE","ADUA",6]
["SV","AGLIADO'",26]
["VIC","AGNESA",6]
["VIA","AGRIFOGLIO (DELL')",12]
["VIA","AIMO MARCO ANTONIO GIUSTINO",12]
["VIA","ALAGON LEONARDO",6]
["VLE","ALBANI LUCIO",13]
["VIA","ALFIERI VITTORIO",8]
["VIA","ALGHERO",4]
["VIA","ALIVESI  GIOVANNI",5]
["TRV","ALIVESI GIOVANNI",5]
["VIA","ALIVIA GAVINO",6]
["VIA","ALLORO (DELL')",15]
["VIA","ALTARA EDINA",13]
["VIA","AMENDOLA GIOVANNI",3]
["VIA","AMSICORA",5]
["VIA","AMUNDSEN ROALD",15]
["VIA","ANFOSSI TOMASO PIETRO (OTTAVA)",24]
["CSO","ANGIOI GIO MARIA",4]
["VIA","ANGIUS VITTORIO",6]
["VIA","ANGLONA",8]
["SP  ","ANGLONA (DELL')",16]
["VIA","ANZIANO (DELL')",15]
{"$rows_left_out":1075}
{"sheet":"Foglio5","index":5,"n_rows":31,"n_cols":11,"rows_kept":31,"cut":false,"hidden":false,"merged":[[0,0,0,9],[0,10,0,14],[1,10,1,14]]}
["                                                  ZONE TARIFFARIE INTERNAZIONALI",null,null,null,null,null,null,null,null,null,"RITORNA A SPECIFICA NOTIFICHE"]
[null,null,null,null,null,null,null,null,null,null,"                         RITORNA A SPECIFICA ESECUZIONI"]
["ZONA 1 ","EUROPA    -   BACINO DEL MEDITERRANEO"]
["Albania, Andorra, Austria, Belgio, Bielorussia, Bosnia-Erzegovina,Bulgaria, Cipro, Croazia, Danimarca, Estonia, Filandia, Francia, Gemania, Gibilterra, Gran Bretagna, "]
["Grecia, Irlanda, Islanda, Kosovo, Lettonia, Liechtenstein, Lituania, Lussemburgo, Macedonia, Malta, Moldavia, Monaco, Montenegro, Norvegia, Olanda, Polonia"]
["Portogallo, Repubblica Ceca, Romania, Russia, Serbia, Slovacchia, Slovenia, Spagna, Svezia, Svizzera, Turchia, Ucraina, Ungheria"]
[]
["Algeria, Egitto, Giordania, Israele, Libano, Marocco, Siria, Tunisia"]
[]
["SAN MARINO - VATICANO"]
[]
["ZONA 2","Altri paesi dell'AFRICA      AMERICHE, ASIA"]
["Angola, Ascensio-Isole (UK), Benin, Botswana, Burkina Faso, Burundi, Camerun, Capo Verde, Ciad, Comore, Costa d'Avorio, Eritrea, Etiopia, Gabon, Gambia, Ghana"]
["Gibuli, Guinea, Guinea Bissau, Kenya, Lesotho, Liberia, Madagascar, Malawl, Mali, Mauritania, Mauitius, Mozambico, Namibia, Niger, Nigeria, Rep. Centrafricana"]
["Rep. Dem. Del Congo, Reunion (isole), Ruanda, Sant'Elena (Isola), Sao Tome&Principe, Senegal, Seychelles, Sierra Leone, Somalia, Sud Africa, Sudan, Swaziland"]
["Tanzania, Togo, Tristan Da Chnha, Uganda, Zambia, Zimbabwe"]
[]
["Antigua&Barbuda, Argentina, Aruba, Bahamas, Barbados, Belize, Bermuda, Bolivia, Brasile, Canada, Cayman Isole, Cile, Colombia, Costa Rica, Cuba, Dominica"]
["Ecuador, El Salvador, Falklands (Isole), Giamaica, Grenada, Groelandia, Guadalupa, Guantanamo Bay, Guatemala, Guyana, Guyana (Francese), Haiti, Honduras"]
["Martinica, Messico, Midway, Montserrat, Nicaragua, Panama, Paraguay, Peru, Porto Rico, Repubblica Dominicana, Saint Kitts Ande Nevis (Saint Christopher)"]
["Saint Pierre&Miquelon, Saint Vincent (E Granadines), Stati Uniti, Suriname, Trinidad&Tobago, Turks And Caicos (Isole), Uruguay, Venezuela, Vergini (Isole)"]
["Br. Vergini (Isole), USA"]
[]
["Afghanistan, Aurabia Saudita, Armenia, Azerbaidjan, Bangladesh, Bhutan, Brunei, Cambogia, Cina, Corea Del Nord - Rep. Dem, Corea Del Sud, Emirati Arabi Uniti"]
["Filippine, Georgia, Giappone, Hong Kong, India, Indonesia, Iran, Kazakistan, Kirghizistan, Kuwait, Laos, Maldive, Malesia, Mongolia, Myanmar Burnma (Birmania)"]
["Nepal, Oman, Qatar, Singapore, Sri Lanka, Tagikistan, Taiwan, Thailandia, Timor Orientale (Est), Turkmenistan, Uzbekista, Vietnam"]
[]
["ZONA 3","OCEANIA"]
["Australia, Christmas (Isole), Cook (Isole), Fanning (Isole), Fiji (Isole), Guam, Kiriball, Marshall (Isole), Nauru, Nuova Caledonia, Nuova Zelanda, Palau, Papua Nuova"]
["Gunea, Phoenix, Pilcairn, Polinesia (Francese), Salpan (Isole Marianne), Salomone (Isole), Samoa (Americane), Samoa (Western), Santa Croce, Tonga (Isole)"]
{"$rows_left_out":2}
{"sheet":"Foglio4","index":6,"n_rows":59,"n_cols":5,"rows_kept":59,"cut":false,"hidden":true,"merged":[]}
[]
[]
[null,"ALA DEI SARDI",null,null,172]
[null,"ALGHERO",null,null,74]
[null,"ARDARA",null,null,64]
[null,"BANARI",null,null,62]
[null,"BESSUDE",null,null,64]
[null,"BONNANARO",null,null,68]
[null,"BONORVA",null,null,100]
[null,"BORUTTA",null,null,72]
[null,"BUDDUSO",null,null,152]
[null,"BULZI",null,null,88]
[null,"CARGEGHE",null,null,26]
[null,"CASTELSARDO",null,null,66]
[null,"CHEREMULE",null,null,78]
[null,"CHIARAMONTI",null,null,72]
[null,"CODRONGIANOS",null,null,32]
[null,"COSSOINE",null,null,94]
[null,"FLORINAS",null,null,34]
[null,"GIAVE",null,null,90]
[null,"ITTIREDDU",null,null,94]
[null,"ITTIRI",null,null,42]
[null,"LAERRU",null,null,88]
[null,"MARA",null,null,100]
[null,"MARTIS",null,null,76]
[null,"MONTELEONE ROCCA DORIA",null,null,84]
[null,"MORES",null,null,76]
[null,"MUROS",null,null,24]
[null,"NUGHEDU SAN NICOLO'",null,null,106]
[null,"NULVI",null,null,62]
{"$rows_left_out":29}